Target
Cholesteryl ester transfer protein
Ligand
BDBM50383596
Substrate
Meas. Tech.
ChEMBL_818747 (CHEMBL2033274)
IC50
55±n/a nM
Citation
 Escribano, AMateo, AIMartin de la Nava, EMMayhugh, DRCockerham, SLBeyer, TPSchmidt, RJCao, GZhang, YJones, TMBorel, AGSweetana, SACannady, EAMantlo, NB Design and synthesis of new tetrahydroquinolines derivatives as CETP inhibitors. Bioorg Med Chem Lett 22:3671-5 (2012)  
Target
Name:
Cholesteryl ester transfer protein
Synonyms:
CETP Cholesteryl ester transfer protein (CETP) | Lipid transfer protein I
Type:
Enzyme
Mol. Mass.:
54751.53
Organism:
Homo sapiens (Human)
Description:
P11597
Residue:
493
  
Inhibitor
Name:
BDBM50383596
Synonyms:
CHEMBL2032419
Type:
Small organic molecule
Emp. Form.:
C28H29F9N6O2
Mol. Mass.:
652.5545
SMILES:
CCC[C@@H]1C[C@H](N(Cc2cc(cc(c2)C(F)(F)F)C(F)(F)F)c2nnn(C)n2)c2cc(ccc2N1C(=O)OC(C)C)C(F)(F)F
: