Target
Hepatocyte growth factor receptor
Ligand
BDBM50384114
Substrate
Meas. Tech.
ChEMBL_819870 (CHEMBL2034584)
IC50
12±n/a nM
Citation
 Bode, CMBoezio, AAAlbrecht, BKBellon, SFBerry, LBroome, MAChoquette, DDussault, ILewis, RTLin, MHRex, KWhittington, DAYang, YHarmange, JC Discovery and optimization of a potent and selective triazolopyridinone series of c-Met inhibitors. Bioorg Med Chem Lett 22:4089-93 (2012)  
Target
Name:
Hepatocyte growth factor receptor
Synonyms:
Hepatocyte growth factor receptor Hepatocyte growth factor receptor (c-MET) MET Met proto-oncogene (hepatocyte growth factor receptor) Tyrosine-protein kinase Met (c-Met) c-Met kinase
Type:
Protein
Mol. Mass.:
155559.73
Organism:
Homo sapiens (Human)
Description:
P08581
Residue:
1390
  
Inhibitor
Name:
BDBM50384114
Synonyms:
CHEMBL2029680
Type:
Small organic molecule
Emp. Form.:
C23H21N5O3S
Mol. Mass.:
447.51
SMILES:
COCCOc1cnc2ccc(cc2c1)[C@H](C)n1nnc2ccn(-c3cccs3)c(=O)c12
: