Target
Hepatocyte growth factor receptor
Ligand
BDBM50384126
Substrate
Meas. Tech.
ChEMBL_819870 (CHEMBL2034584)
IC50
110±n/a nM
Citation
 Bode, CMBoezio, AAAlbrecht, BKBellon, SFBerry, LBroome, MAChoquette, DDussault, ILewis, RTLin, MHRex, KWhittington, DAYang, YHarmange, JC Discovery and optimization of a potent and selective triazolopyridinone series of c-Met inhibitors. Bioorg Med Chem Lett 22:4089-93 (2012)  
Target
Name:
Hepatocyte growth factor receptor
Synonyms:
Hepatocyte growth factor receptor Hepatocyte growth factor receptor (c-MET) MET Met proto-oncogene (hepatocyte growth factor receptor) Tyrosine-protein kinase Met (c-Met) c-Met kinase
Type:
Protein
Mol. Mass.:
155559.73
Organism:
Homo sapiens (Human)
Description:
P08581
Residue:
1390
  
Inhibitor
Name:
BDBM50384126
Synonyms:
CHEMBL2029684
Type:
Small organic molecule
Emp. Form.:
C22H15F2N5O2
Mol. Mass.:
419.3836
SMILES:
COc1cnc2ccc(Cn3nnc4ccn(-c5cc(F)cc(F)c5)c(=O)c34)cc2c1
: