Target
Potassium voltage-gated channel subfamily H member 2
Ligand
BDBM50384149
Substrate
Meas. Tech.
ChEMBL_820025 (CHEMBL2032798)
IC50
>33000±n/a nM
Citation
 Wei, ZYang, HLiu, ZTremblay, MJohnstone, SBéha, SYue, SYSrivastava, STomaszewski, MJBrown, WWalpole, CSt-Onge, SLessard, EArchambault, AJGroblewski, TPagé, D N-Methyl-3-(tetrahydro-2H-pyran-4-yl)-2,3,4,9-tetrahydro-1H-carbazole-6-carboxamides as a novel class of cannabinoid receptors agonists with low CNS penetration. Bioorg Med Chem Lett 22:3884-9 (2012)  
Target
Name:
Potassium voltage-gated channel subfamily H member 2
Synonyms:
1,3-beta-glucan synthase component GLS2 ERG Eag-related protein 1 Ether-a-go-go-related gene (HERG) Ether-a-go-go-related gene potassium channel 1 Ether-a-go-go-related gene potassium channel 1 (hERG1) Ether-a-go-go-related protein 1 H-ERG KCNH2 Potassium voltage-gated channel subfamily H member 2 (hERG) Voltage-gated potassium channel subunit Kv11.1 hERG Potassium Channel 1 | putative potassium channel subunit
Type:
Multi-pass membrane protein
Mol. Mass.:
126672.65
Organism:
Homo sapiens (Human)
Description:
Q12809
Residue:
1159
  
Inhibitor
Name:
BDBM50384149
Synonyms:
CHEMBL2029725
Type:
Small organic molecule
Emp. Form.:
C25H33N3O3
Mol. Mass.:
423.5478
SMILES:
CN(CC(=O)NC1CC1)C(=O)c1ccc2n(C)c3CC[C@H](Cc3c2c1)C1CCOCC1
: