Target
Cannabinoid receptor 1
Ligand
BDBM50384148
Substrate
Meas. Tech.
ChEMBL_820020 (CHEMBL2032793)
Ki
53.7±n/a nM
Citation
 Wei, ZYang, HLiu, ZTremblay, MJohnstone, SBéha, SYue, SYSrivastava, STomaszewski, MJBrown, WWalpole, CSt-Onge, SLessard, EArchambault, AJGroblewski, TPagé, D N-Methyl-3-(tetrahydro-2H-pyran-4-yl)-2,3,4,9-tetrahydro-1H-carbazole-6-carboxamides as a novel class of cannabinoid receptors agonists with low CNS penetration. Bioorg Med Chem Lett 22:3884-9 (2012)  
Target
Name:
Cannabinoid receptor 1
Synonyms:
CANN6 CB-R CNR CNR1_HUMAN Cannabinoid receptor Cannabinoid receptor 1 (brain)
Type:
G Protein-Coupled Receptor (GPCR)
Mol. Mass.:
52868.96
Organism:
Homo sapiens (Human)
Description:
P21554
Residue:
472
  
Inhibitor
Name:
BDBM50384148
Synonyms:
CHEMBL2029724
Type:
Small organic molecule
Emp. Form.:
C25H35N3O3
Mol. Mass.:
425.5637
SMILES:
CNC(=O)CCCN(C)C(=O)c1ccc2n(C)c3CCC(Cc3c2c1)C1CCOCC1
: