Target
Cannabinoid receptor 1
Ligand
BDBM50384152
Substrate
Meas. Tech.
ChEMBL_820022 (CHEMBL2032795)
EC50
43.7±n/a nM
Citation
 Wei, ZYang, HLiu, ZTremblay, MJohnstone, SBéha, SYue, SYSrivastava, STomaszewski, MJBrown, WWalpole, CSt-Onge, SLessard, EArchambault, AJGroblewski, TPagé, D N-Methyl-3-(tetrahydro-2H-pyran-4-yl)-2,3,4,9-tetrahydro-1H-carbazole-6-carboxamides as a novel class of cannabinoid receptors agonists with low CNS penetration. Bioorg Med Chem Lett 22:3884-9 (2012)  
Target
Name:
Cannabinoid receptor 1
Synonyms:
CANN6 CB-R CNR CNR1_HUMAN Cannabinoid receptor Cannabinoid receptor 1 (brain)
Type:
G Protein-Coupled Receptor (GPCR)
Mol. Mass.:
52868.96
Organism:
Homo sapiens (Human)
Description:
P21554
Residue:
472
  
Inhibitor
Name:
BDBM50384152
Synonyms:
CHEMBL2029734
Type:
Small organic molecule
Emp. Form.:
C27H37N3O4
Mol. Mass.:
467.6004
SMILES:
CN(CCCC(=O)NC1COC1)C(=O)c1ccc2n(C)c3CC[C@H](Cc3c2c1)C1CCOCC1
: