Target
Microtubule-associated protein tau
Ligand
BDBM50384538
Substrate
Meas. Tech.
ChEMBL_820514 (CHEMBL2040089)
Ki
13±n/a nM
Citation
 Matsumura, KOno, MKimura, HUeda, MNakamoto, YTogashi, KOkamoto, YIhara, MTakahashi, RSaji, H (18)F-labeled phenyldiazenyl benzothiazole for in vivo imaging of neurofibrillary tangles in Alzheimer's disease brains. ACS Med Chem Lett 3:58-62 (2012)  
Target
Name:
Microtubule-associated protein tau
Synonyms:
MAPT MTBT1 Neurofibrillary tangle protein Paired helical filament-tau TAU_HUMAN | Tau Protein
Type:
Protein
Mol. Mass.:
78928.63
Organism:
Homo sapiens (Human)
Description:
P10636
Residue:
758
  
Inhibitor
Name:
BDBM50384538
Synonyms:
CHEMBL2036419 | CHEMBL2036420
Type:
Small organic molecule
Emp. Form.:
C21H25FN4O3S
Mol. Mass.:
432.512
SMILES:
CN(C)c1ccc(cc1)\N=N\c1nc2ccc(OCCOCCOCCF)cc2s1
: