Target
Tyrosine-protein kinase receptor TYRO3
Ligand
BDBM50384582
Substrate
Meas. Tech.
ChEMBL_820661 (CHEMBL2037932)
IC50
22±n/a nM
Citation
 Liu, JYang, CSimpson, CDeryckere, DVan Deusen, AMiley, MJKireev, DNorris-Drouin, JSather, SHunter, DKorboukh, VKPatel, HSJanzen, WPMachius, MJohnson, GLEarp, HSGraham, DKFrye, SVWang, X Discovery of Novel Small Molecule Mer Kinase Inhibitors for the Treatment of Pediatric Acute Lymphoblastic Leukemia. ACS Med Chem Lett 3:129-134 (2012)  
Target
Name:
Tyrosine-protein kinase receptor TYRO3
Synonyms:
BYK RSE TIF TYRO3_HUMAN | Tyrosine-protein kinase SKY
Type:
Protein
Mol. Mass.:
96894.13
Organism:
Homo sapiens (Human)
Description:
Q06418
Residue:
890
  
Inhibitor
Name:
BDBM50384582
Synonyms:
CHEMBL2036805
Type:
Small organic molecule
Emp. Form.:
C30H39N9
Mol. Mass.:
525.691
SMILES:
N[C@H]1CC[C@H](Cn2nc(-c3ccc(nc3)N3CCNCC3)c3cnc(NCCCc4ccccc4)nc23)CC1
: