Target
ALK tyrosine kinase receptor
Ligand
BDBM50384727
Substrate
Meas. Tech.
ChEMBL_820924 (CHEMBL2038865)
IC50
3400±n/a nM
Citation
 Albaugh, PFan, YMi, YSun, FAdrian, FLi, NJia, YSarkisova, YKreusch, AHood, TLu, MLiu, GHuang, SLiu, ZLoren, JTuntland, TKaranewsky, DSSeidel, HMMolteni, V Discovery of GNF-5837, a Selective TRK Inhibitor with Efficacy in Rodent Cancer Tumor Models. ACS Med Chem Lett 3:140-145 (2012)  
Target
Name:
ALK tyrosine kinase receptor
Synonyms:
ALK_MOUSE Anaplastic lymphoma kinase | CD_antigen=CD246
Type:
PROTEIN
Mol. Mass.:
174957.04
Organism:
Mus musculus
Description:
ChEMBL_820924
Residue:
1621
  
Inhibitor
Name:
BDBM50384727
Synonyms:
CHEMBL2037226
Type:
Small organic molecule
Emp. Form.:
C28H21F4N5O2
Mol. Mass.:
535.4923
SMILES:
Cc1ccc(NC(=O)Nc2cc(ccc2F)C(F)(F)F)cc1Nc1ccc2\C(=C\c3ccc[nH]3)C(=O)Nc2c1
: