Target
Oxytocin receptor
Ligand
BDBM50384823
Substrate
Meas. Tech.
ChEMBL_821157 (CHEMBL2039699)
Ki
0.0398±n/a nM
Citation
 Borthwick, ADLiddle, JDavies, DEExall, AMHamlett, CHickey, DMMason, AMSmith, IENerozzi, FPeace, SPollard, DSollis, SLAllen, MJWoollard, PMPullen, MAWestfall, TDStanislaus, DJ Pyridyl-2,5-diketopiperazines as potent, selective, and orally bioavailable oxytocin antagonists: synthesis, pharmacokinetics, and in vivo potency. J Med Chem 55:783-96 (2012)  
Target
Name:
Oxytocin receptor
Synonyms:
OT-R OXYR_HUMAN | Oxytocin
Type:
Enzyme Catalytic Domain
Mol. Mass.:
42793.26
Organism:
Homo sapiens (Human)
Description:
Oxytocin OXTR HEK293::B2R9L7
Residue:
389
  
Inhibitor
Name:
BDBM50384823
Synonyms:
CHEMBL2037507
Type:
Small organic molecule
Emp. Form.:
C28H36N4O3
Mol. Mass.:
476.6104
SMILES:
CC[C@H](C)[C@H]1N([C@@H](C(=O)N(C)C)c2cnc(C)cc2C)C(=O)[C@H](NC1=O)C1Cc2ccccc2C1
: