Target
Non-receptor tyrosine-protein kinase TYK2
Ligand
BDBM50384875
Substrate
Meas. Tech.
ChEMBL_821292 (CHEMBL2040122)
IC50
590±n/a nM
Citation
 William, ADLee, ACPoulsen, AGoh, KCMadan, BHart, STan, EWang, HNagaraj, HChen, DLee, CPSun, ETJayaraman, RPasha, MKEthirajulu, KWood, JMDymock, BW Discovery of the macrocycle (9E)-15-(2-(pyrrolidin-1-yl)ethoxy)-7,12,25-trioxa-19,21,24-triaza-tetracyclo[18.3.1.1(2,5).1(14,18)]hexacosa-1(24),2,4,9,14(26),15,17,20,22-nonaene (SB1578), a potent inhibitor of janus kinase 2/fms-like tyrosine kinase-3 (JAK2/FLT3) for the treatment of rheumatoid arth J Med Chem 55:2623-40 (2012)  
Target
Name:
Non-receptor tyrosine-protein kinase TYK2
Synonyms:
Non-receptor tyrosine-protein kinase TYK2 (TYK2) TYK2_HUMAN | Tyrosine-protein kinase TYK2
Type:
Protein
Mol. Mass.:
133666.03
Organism:
Homo sapiens (Human)
Description:
P29597
Residue:
1187
  
Inhibitor
Name:
BDBM50384875
Synonyms:
CHEMBL2035056
Type:
Small organic molecule
Emp. Form.:
C24H28N4O4
Mol. Mass.:
436.5035
SMILES:
COCCOc1ccc2Nc3nccc(n3)-c3ccc(COC\C=C\CN(C)Cc1c2)o3
: