Target
5'-AMP-activated protein kinase catalytic subunit alpha-1
Ligand
BDBM50384888
Substrate
Meas. Tech.
ChEMBL_821806 (CHEMBL2039250)
IC50
>3000±n/a nM
Citation
 Cha, MYLee, KOKang, SJJung, YHSong, JYChoi, KJByun, JYLee, HJLee, GSPark, SBKim, MS Synthesis and biological evaluation of pyrimidine-based dual inhibitors of human epidermal growth factor receptor 1 (HER-1) and HER-2 tyrosine kinases. J Med Chem 55:2846-57 (2012)  
Target
Name:
5'-AMP-activated protein kinase catalytic subunit alpha-1
Synonyms:
AAPK1_HUMAN AMP-activated protein kinase alpha-1/beta-2/gamma-2 AMPK subunit alpha-1 AMPK1 PRKAA1 | Tau-protein kinase PRKAA1
Type:
Protein
Mol. Mass.:
64023.62
Organism:
Homo sapiens (Human)
Description:
Q13131
Residue:
559
  
Inhibitor
Name:
BDBM50384888
Synonyms:
CHEMBL2035810
Type:
Small organic molecule
Emp. Form.:
C23H20ClN7O3
Mol. Mass.:
477.903
SMILES:
Nc1ncnc(Nc2ccc(OCc3ccccn3)c(Cl)c2)c1-c1nc(CNC(=O)C=C)co1
: