Target
Mast/stem cell growth factor receptor Kit
Ligand
BDBM50384888
Substrate
Meas. Tech.
ChEMBL_821809 (CHEMBL2039253)
IC50
>3000±n/a nM
Citation
 Cha, MYLee, KOKang, SJJung, YHSong, JYChoi, KJByun, JYLee, HJLee, GSPark, SBKim, MS Synthesis and biological evaluation of pyrimidine-based dual inhibitors of human epidermal growth factor receptor 1 (HER-1) and HER-2 tyrosine kinases. J Med Chem 55:2846-57 (2012)  
Target
Name:
Mast/stem cell growth factor receptor Kit
Synonyms:
CD117 antigen KIT Mast/stem cell growth factor receptor Kit (cKIT) Proto-oncogene tyrosine-protein kinase Kit Stem cell growth factor receptor Tyrosine-protein kinase Kit c-kit v-kit Hardy-Zuckerman 4 feline sarcoma viral oncogene homolog
Type:
Protein
Mol. Mass.:
109869.37
Organism:
Homo sapiens (Human)
Description:
P10721
Residue:
976
  
Inhibitor
Name:
BDBM50384888
Synonyms:
CHEMBL2035810
Type:
Small organic molecule
Emp. Form.:
C23H20ClN7O3
Mol. Mass.:
477.903
SMILES:
Nc1ncnc(Nc2ccc(OCc3ccccn3)c(Cl)c2)c1-c1nc(CNC(=O)C=C)co1
: