Target
Peroxisome proliferator-activated receptor delta
Ligand
BDBM28661
Substrate
Meas. Tech.
ChEMBL_820748 (CHEMBL2038153)
EC50
24±n/a nM
Citation
 Ham, JHwang, HKim, EKim, JACho, SJKo, JLee, WLee, JHolla, HBanerjee, JKim, SYang, ILee, HJShin, KChoi, HNam, SJTak, JHahn, DOh, TWon, DHLee, TGChoi, JPark, MSSeok, CChin, JKang, H Discovery, design and synthesis of Y-shaped peroxisome proliferator-activated receptord agonists as potent anti-obesity agents in vivo. Eur J Med Chem 53:190-202 (2012)  
Target
Name:
Peroxisome proliferator-activated receptor delta
Synonyms:
NR1C2 NUCI Nuclear receptor subfamily 1 group C member 2 PPAR-beta PPARD Peroxisome proliferator-activated receptor Peroxisome proliferator-activated receptor delta
Type:
Enzyme
Mol. Mass.:
49910.45
Organism:
Homo sapiens (Human)
Description:
Q03181
Residue:
441
  
Inhibitor
Name:
BDBM28661
Synonyms:
2-{2-methyl-4-[({4-methyl-2-[4-(trifluoromethyl)phenyl]-1,3-thiazol-5-yl}methyl)sulfanyl]phenoxy}acetic acid GW 501516 GW1516 | GW501516
Type:
Small organic molecule
Emp. Form.:
C21H18F3NO3S2
Mol. Mass.:
453.498
SMILES:
Cc1nc(sc1CSc1ccc(OCC(O)=O)c(C)c1)-c1ccc(cc1)C(F)(F)F
: