Target
Serine/threonine-protein kinase pim-3
Ligand
BDBM50383711
Substrate
Meas. Tech.
ChEMBL_821480 (CHEMBL2038010)
IC50
11±n/a nM
Citation
 Tsuhako, ALBrown, DSKoltun, ESAay, NArcalas, AChan, VDu, HEngst, SFranzini, MGalan, AHuang, PJohnston, SKane, BKim, MHLaird, ADLin, RMock, LNgan, IPack, MStott, GStout, TJYu, PZaharia, CZhang, WZhou, PNuss, JMKearney, PCXu, W The design, synthesis, and biological evaluation of PIM kinase inhibitors. Bioorg Med Chem Lett 22:3732-8 (2012)  
Target
Name:
Serine/threonine-protein kinase pim-3
Synonyms:
PIM3 Serine/threonine-protein kinase pim-3 (PIM3)
Type:
Protein
Mol. Mass.:
35888.19
Organism:
Homo sapiens (Human)
Description:
Q86V86
Residue:
326
  
Inhibitor
Name:
BDBM50383711
Synonyms:
CHEMBL2030387
Type:
Small organic molecule
Emp. Form.:
C15H15BrN4O2
Mol. Mass.:
363.209
SMILES:
N[C@H]1CCN(Cc2nc3c4cc(Br)ccc4oc3c(=O)[nH]2)C1
: