Target
Prostaglandin E2 receptor EP1 subtype
Ligand
BDBM50385119
Substrate
Meas. Tech.
ChEMBL_822926 (CHEMBL2038097)
Ki
>10000±n/a nM
Citation
 Kambe, TMaruyama, TNakai, YOida, HMaruyama, TAbe, NNishiura, ANakai, HToda, M Synthesis and evaluation of¿-lactam analogs of PGE2 as EP4 and EP2/EP4 agonists. Bioorg Med Chem 20:3502-22 (2012)  
Target
Name:
Prostaglandin E2 receptor EP1 subtype
Synonyms:
PE2R1_MOUSE Prostaglandin E1 Prostanoid EP1 receptor Ptgerep1
Type:
G-protein coupled receptor
Mol. Mass.:
43000.62
Organism:
Mus musculus (Mouse)
Description:
Residue:
405
  
Inhibitor
Name:
BDBM50385119
Synonyms:
CHEMBL2036309
Type:
Small organic molecule
Emp. Form.:
C25H30N2O4S
Mol. Mass.:
454.582
SMILES:
O[C@@H](Cc1cccc(c1)-c1ccccn1)\C=C\[C@H]1CCC(=O)N1CCSCCCC(O)=O
: