Target
Peroxisome proliferator-activated receptor alpha
Ligand
BDBM50126018
Substrate
Meas. Tech.
ChEMBL_822292 (CHEMBL2038446)
IC50
279.9±n/a nM
Citation
 Méndez-Lucio, OPérez-Villanueva, JCastillo, RMedina-Franco, JL Activity landscape modeling of PPAR ligands with dual-activity difference maps. Bioorg Med Chem 20:3523-32 (2012)  
Target
Name:
Peroxisome proliferator-activated receptor alpha
Synonyms:
NR1C1 PPAR PPAR-alpha PPARA_HUMAN Peroxisome proliferator-activated receptor | Peroxisome proliferator-activated receptor alpha (PPAR alpha)
Type:
Enzyme
Mol. Mass.:
52222.08
Organism:
Homo sapiens (Human)
Description:
Q07869
Residue:
468
  
Inhibitor
Name:
BDBM50126018
Synonyms:
2-(3-chloro-4-(3-(7-propyl-3-(trifluoromethyl)benzo[d]isoxazol-6-yloxy)propylthio)phenyl)acetic acid {3-Chloro-4-[3-(7-propyl-3-trifluoromethyl-benzo[d]isoxazol-6-yloxy)-propylsulfanyl]-phenyl}-acetic acid | {3-chloro-4-[(3-{[7-propyl-3-(trifluoromethyl)-1,2-benzisoxazol-6-yl]oxy}propyl)sulfanyl]phenyl}acetic acid
Type:
Small organic molecule
Emp. Form.:
C22H21ClF3NO4S
Mol. Mass.:
487.92
SMILES:
CCCc1c(OCCCSc2ccc(CC(O)=O)cc2Cl)ccc2c(noc12)C(F)(F)F
: