Target
Polymerase acidic protein
Ligand
BDBM50385492
Substrate
Meas. Tech.
ChEMBL_823233 (CHEMBL2040651)
Ki
1610±n/a nM
Citation
 Baughman, BMJake Slavish, PDuBois, RMBoyd, VAWhite, SWWebb, TR Identification of influenza endonuclease inhibitors using a novel fluorescence polarization assay. ACS Chem Biol 7:526-34 (2012)  
Target
Name:
Polymerase acidic protein
Synonyms:
Hepatitis C virus polyprotein PA/PB1 Polymerase acidic protein | RNA-directed RNA polymerase subunit P2
Type:
PROTEIN
Mol. Mass.:
82573.84
Organism:
Hepatitis C virus
Description:
ChEMBL_64976
Residue:
716
  
Inhibitor
Name:
BDBM50385492
Synonyms:
CHEMBL2040582
Type:
Small organic molecule
Emp. Form.:
C18H17N5O3
Mol. Mass.:
351.3593
SMILES:
C[C@@H](NC(=O)c1nc([nH]c(=O)c1O)-c1cnccn1)c1ccc(C)cc1
: