Target
Polymerase acidic protein
Ligand
BDBM50115579
Substrate
Meas. Tech.
ChEMBL_823234 (CHEMBL2040652)
EC50
2070±n/a nM
Citation
 Baughman, BMJake Slavish, PDuBois, RMBoyd, VAWhite, SWWebb, TR Identification of influenza endonuclease inhibitors using a novel fluorescence polarization assay. ACS Chem Biol 7:526-34 (2012)  
Target
Name:
Polymerase acidic protein
Synonyms:
Hepatitis C virus polyprotein PA/PB1 Polymerase acidic protein | RNA-directed RNA polymerase subunit P2
Type:
PROTEIN
Mol. Mass.:
82573.84
Organism:
Hepatitis C virus
Description:
ChEMBL_64976
Residue:
716
  
Inhibitor
Name:
BDBM50115579
Synonyms:
(Z)-2-hydroxy-4-oxo-4-phenyl-but-2-enoic acid 2-Hydroxy-4-oxo-4-phenyl-but-2-enoic acid (0.25H2O) CHEMBL19332 Sacchettini_CTRL
Type:
Small organic molecule
Emp. Form.:
C10H8O4
Mol. Mass.:
192.1681
SMILES:
OC(=O)C(=O)CC(=O)c1ccccc1
: