Target
Polymerase acidic protein
Ligand
BDBM50137869
Substrate
Meas. Tech.
ChEMBL_823234 (CHEMBL2040652)
EC50
>250000±n/a nM
Citation
 Baughman, BMJake Slavish, PDuBois, RMBoyd, VAWhite, SWWebb, TR Identification of influenza endonuclease inhibitors using a novel fluorescence polarization assay. ACS Chem Biol 7:526-34 (2012)  
Target
Name:
Polymerase acidic protein
Synonyms:
Hepatitis C virus polyprotein PA/PB1 Polymerase acidic protein | RNA-directed RNA polymerase subunit P2
Type:
PROTEIN
Mol. Mass.:
82573.84
Organism:
Hepatitis C virus
Description:
ChEMBL_64976
Residue:
716
  
Inhibitor
Name:
BDBM50137869
Synonyms:
2,4-Dioxo-4-pyridin-3-yl-butyric acid CHEMBL2040556
Type:
Small organic molecule
Emp. Form.:
C9H7NO4
Mol. Mass.:
193.1562
SMILES:
OC(=O)C(=O)CC(=O)c1cccnc1
: