Target
Polymerase acidic protein
Ligand
BDBM50385515
Substrate
Meas. Tech.
ChEMBL_823234 (CHEMBL2040652)
EC50
3660±n/a nM
Citation
 Baughman, BMJake Slavish, PDuBois, RMBoyd, VAWhite, SWWebb, TR Identification of influenza endonuclease inhibitors using a novel fluorescence polarization assay. ACS Chem Biol 7:526-34 (2012)  
Target
Name:
Polymerase acidic protein
Synonyms:
Hepatitis C virus polyprotein PA/PB1 Polymerase acidic protein | RNA-directed RNA polymerase subunit P2
Type:
PROTEIN
Mol. Mass.:
82573.84
Organism:
Hepatitis C virus
Description:
ChEMBL_64976
Residue:
716
  
Inhibitor
Name:
BDBM50385515
Synonyms:
CHEMBL2040569
Type:
Small organic molecule
Emp. Form.:
C13H13N5O3
Mol. Mass.:
287.274
SMILES:
Oc1c(nc([nH]c1=O)-c1cnccn1)C(=O)NCC1CC1
: