Target
Polymerase acidic protein
Ligand
BDBM50385528
Substrate
Meas. Tech.
ChEMBL_823237 (CHEMBL2040655)
IC50
180±n/a nM
Citation
 Hastings, JCSelnick, HWolanski, BTomassini, JE Anti-influenza virus activities of 4-substituted 2,4-dioxobutanoic acid inhibitors. Antimicrob Agents Chemother 40:1304-7 (1996)  
Target
Name:
Polymerase acidic protein
Synonyms:
Hepatitis C virus polyprotein PA/PB1 Polymerase acidic protein | RNA-directed RNA polymerase subunit P2
Type:
PROTEIN
Mol. Mass.:
82573.84
Organism:
Hepatitis C virus
Description:
ChEMBL_64976
Residue:
716
  
Inhibitor
Name:
BDBM50385528
Synonyms:
CHEMBL2040586
Type:
Small organic molecule
Emp. Form.:
C23H23Cl2NO4
Mol. Mass.:
448.339
SMILES:
OC(=O)C(=O)CC(=O)C1(Cc2ccc(Cl)cc2)CCN(Cc2ccc(Cl)cc2)CC1
: