Target
AMP deaminase 3
Ligand
BDBM50096172
Substrate
Meas. Tech.
ChEMBL_825833 (CHEMBL2044562)
Ki
2±n/a nM
Citation
 Lindell, SDMaechling, SSabina, RL Synthesis and Biochemical Testing of 3-(Carboxyphenylethyl)imidazo[2,1-f][1,2,4]triazines as Inhibitors of AMP Deaminase. ACS Med Chem Lett 1:286-289 (2010)  
Target
Name:
AMP deaminase 3
Synonyms:
AMP deaminase 3 AMPD3 | AMPD3_HUMAN
Type:
Protein
Mol. Mass.:
88818.80
Organism:
Homo sapiens (Human)
Description:
Residue:
767
  
Inhibitor
Name:
BDBM50096172
Synonyms:
1-Bromo-4-[2-(8-hydroxy-7,8-dihydro-6H-imidazo[4,5-d][1,3]diazepin-3-yl)-ethyl]-5,6,7,8-tetrahydro-naphthalene-2-carboxylic acid | CHEMBL346040
Type:
Small organic molecule
Emp. Form.:
C19H21BrN4O3
Mol. Mass.:
433.299
SMILES:
OC1CNC=Nc2c1ncn2CCc1cc(C(O)=O)c(Br)c2CCCCc12
: