Target
ALK tyrosine kinase receptor
Ligand
BDBM50385593
Substrate
Meas. Tech.
ChEMBL_825874 (CHEMBL2044751)
IC50
1±n/a nM
Citation
 Ott, GRTripathy, RCheng, MMcHugh, RAnzalone, AVUnderiner, TLCurry, MAQuail, MRLu, LWan, WAngeles, TSAlbom, MSAimone, LDAtor, MARuggeri, BADorsey, BD Discovery of a potent inhibitor of anaplastic lymphoma kinase with in vivo antitumor activity. ACS Med Chem Lett 1:493-498 (2010)  
Target
Name:
ALK tyrosine kinase receptor
Synonyms:
ALK ALK_HUMAN CD_antigen: CD246
Type:
Protein
Mol. Mass.:
176453.10
Organism:
Homo sapiens (Human)
Description:
Q9UM73
Residue:
1620
  
Inhibitor
Name:
BDBM50385593
Synonyms:
CHEMBL2042694
Type:
Small organic molecule
Emp. Form.:
C22H23ClN6O3S
Mol. Mass.:
486.974
SMILES:
CNS(=O)(=O)c1ccccc1Nc1nc(Nc2ccc3N(C)C(=O)CCCc3c2)ncc1Cl
: