Target
Insulin receptor
Ligand
BDBM50385601
Substrate
Meas. Tech.
ChEMBL_825876 (CHEMBL2044753)
IC50
32±n/a nM
Citation
 Ott, GRTripathy, RCheng, MMcHugh, RAnzalone, AVUnderiner, TLCurry, MAQuail, MRLu, LWan, WAngeles, TSAlbom, MSAimone, LDAtor, MARuggeri, BADorsey, BD Discovery of a potent inhibitor of anaplastic lymphoma kinase with in vivo antitumor activity. ACS Med Chem Lett 1:493-498 (2010)  
Target
Name:
Insulin receptor
Synonyms:
INSR INSR_HUMAN Insulin receptor beta subunit
Type:
Receptor Tyrosine Kinase
Mol. Mass.:
156322.60
Organism:
Homo sapiens (Human)
Description:
P06213
Residue:
1382
  
Inhibitor
Name:
BDBM50385601
Synonyms:
CHEMBL2042982
Type:
Small organic molecule
Emp. Form.:
C26H30ClN5O4S
Mol. Mass.:
544.065
SMILES:
CCN1c2ccc(Nc3ncc(Cl)c(Nc4ccccc4S(=O)(=O)C(C)C)n3)c(OC)c2CCCC1=O
: