Target
Transient receptor potential cation channel subfamily V member 1
Ligand
BDBM50385671
Substrate
Meas. Tech.
ChEMBL_826074 (CHEMBL2045505)
Ki
7.4±n/a nM
Citation
 Kim, YSKil, MJKang, SURyu, HKim, MSCho, YBhondwe, RSThorat, SASun, WLiu, KLee, JHChoi, SPearce, LVPavlyukovets, VAMorgan, MATran, RLazar, JBlumberg, PMLee, J N-4-t-Butylbenzyl 2-(4-methylsulfonylaminophenyl) propanamide TRPV1 antagonists: Structure-activity relationships in the A-region. Bioorg Med Chem 20:215-24 (2011)  
Target
Name:
Transient receptor potential cation channel subfamily V member 1
Synonyms:
Capsaicin receptor TRPV1_RAT Trpv1 Vanilloid VR1 Vanilloid receptor 1 (VRI/TRPV1) Vanilloid receptor type 1-like (TrpV1/Vr1) Vr1l | osm-9-like TRP channel 1
Type:
Transient Receptor
Mol. Mass.:
94956.12
Organism:
Rattus norvegicus (rat)
Description:
O35433
Residue:
838
  
Inhibitor
Name:
BDBM50385671
Synonyms:
CHEMBL2042384
Type:
Small organic molecule
Emp. Form.:
C21H26F2N2O3S
Mol. Mass.:
424.505
SMILES:
CC(C(=O)NCc1ccc(cc1)C(C)(C)C)c1cc(F)c(NS(C)(=O)=O)c(F)c1
: