Target
Muscarinic acetylcholine receptor M3
Ligand
BDBM50385673
Substrate
Meas. Tech.
ChEMBL_826080 (CHEMBL2045511)
Ki
61.66±n/a nM
Citation
 Del Bello, FBarocelli, EBertoni, SBonifazi, ACamalli, MCampi, GGiannella, MMatucci, RNesi, MPigini, MQuaglia, WPiergentili, A 1,4-dioxane, a suitable scaffold for the development of novel M3 muscarinic receptor antagonists. J Med Chem 55:1783-7 (2012)  
Target
Name:
Muscarinic acetylcholine receptor M3
Synonyms:
ACM3_HUMAN Cholinergic, muscarinic M3 Muscarinic receptor M3 | RecName: Full=Muscarinic acetylcholine receptor M3
Type:
Enzyme
Mol. Mass.:
66151.03
Organism:
Homo sapiens (Human)
Description:
P20309
Residue:
590
  
Inhibitor
Name:
BDBM50385673
Synonyms:
CHEMBL2042406
Type:
Small organic molecule
Emp. Form.:
C20H26NO2
Mol. Mass.:
312.4254
SMILES:
C[N+](C)(C)C[C@@H]1COCC(O1)(c1ccccc1)c1ccccc1
: