Target
Muscarinic acetylcholine receptor M2
Ligand
BDBM50385673
Substrate
Meas. Tech.
ChEMBL_826079 (CHEMBL2045510)
Ki
5.75±n/a nM
Citation
 Del Bello, FBarocelli, EBertoni, SBonifazi, ACamalli, MCampi, GGiannella, MMatucci, RNesi, MPigini, MQuaglia, WPiergentili, A 1,4-dioxane, a suitable scaffold for the development of novel M3 muscarinic receptor antagonists. J Med Chem 55:1783-7 (2012)  
Target
Name:
Muscarinic acetylcholine receptor M2
Synonyms:
ACM2_HUMAN Cholinergic, muscarinic M2 Muscarinic acetylcholine receptor M2 and M5 | RecName: Full=Muscarinic acetylcholine receptor M2
Type:
GPCR
Mol. Mass.:
51730.61
Organism:
Homo sapiens (Human)
Description:
P08172
Residue:
466
  
Inhibitor
Name:
BDBM50385673
Synonyms:
CHEMBL2042406
Type:
Small organic molecule
Emp. Form.:
C20H26NO2
Mol. Mass.:
312.4254
SMILES:
C[N+](C)(C)C[C@@H]1COCC(O1)(c1ccccc1)c1ccccc1
: