Target
Aldo-keto reductase family 1 member C1
Ligand
BDBM50385687
Substrate
Meas. Tech.
ChEMBL_823520 (CHEMBL2045963)
IC50
4230±n/a nM
Citation
 Adeniji, AOTwenter, BMByrns, MCJin, YChen, MWinkler, JDPenning, TM Development of potent and selective inhibitors of aldo-keto reductase 1C3 (type 5 17ß-hydroxysteroid dehydrogenase) based on N-phenyl-aminobenzoates and their structure-activity relationships. J Med Chem 55:2311-23 (2012)  
Target
Name:
Aldo-keto reductase family 1 member C1
Synonyms:
20-alpha-HSD AK1C1_HUMAN Aldo-keto reductase family 1 member C1 (AK1C1) Aldo-keto reductase family 1 member C1 (AKR1C1) DDH High-affinity hepatic bile acid-binding protein | Trans-1,2-dihydrobenzene-1,2-diol dehydrogenase
Type:
Enzyme
Mol. Mass.:
36793.97
Organism:
Homo sapiens (Human)
Description:
Recombinant AKR1C1 enzyme was expressed in E. coli.
Residue:
323
  
Inhibitor
Name:
BDBM50385687
Synonyms:
CHEMBL2041555
Type:
Small organic molecule
Emp. Form.:
C14H9F3N2O4
Mol. Mass.:
326.2275
SMILES:
OC(=O)c1cccc(Nc2ccc(cc2[N+]([O-])=O)C(F)(F)F)c1
: