Target
cGMP-inhibited 3',5'-cyclic phosphodiesterase 3A
Ligand
BDBM50385906
Substrate
Meas. Tech.
ChEMBL_823679 (CHEMBL2044994)
IC50
1800±n/a nM
Citation
 Redondo, MBrea, JPerez, DISoteras, IVal, CPerez, CMorales-García, JAAlonso-Gil, SPaul-Fernandez, NMartin-Alvarez, RCadavid, MILoza, MIPerez-Castillo, AMengod, GCampillo, NEMartinez, AGil, C Effect of phosphodiesterase 7 (PDE7) inhibitors in experimental autoimmune encephalomyelitis mice. Discovery of a new chemically diverse family of compounds. J Med Chem 55:3274-84 (2012)  
Target
Name:
cGMP-inhibited 3',5'-cyclic phosphodiesterase 3A
Synonyms:
3',5'-cyclic phosphodiesterase Cyclic GMP-inhibited phosphodiesterase A PDE3A_HUMAN Phosphodiesterase 3 (PDE3) Phosphodiesterase 3A Phosphodiesterase 3A (PDE3A1) cGMP-inhibited 3',5'-cyclic phosphodiesterase A | cGMP-inhibited 3,5-cyclic phosphodiesterase A
Type:
Enzyme
Mol. Mass.:
124966.46
Organism:
Homo sapiens (Human)
Description:
Q14432
Residue:
1141
  
Inhibitor
Name:
BDBM50385906
Synonyms:
CHEMBL2041597
Type:
Small organic molecule
Emp. Form.:
C22H19F3O6
Mol. Mass.:
436.3779
SMILES:
COc1cc(COC(=O)c2ccc(o2)-c2ccccc2C(F)(F)F)cc(OC)c1OC
: