Target
Tyrosine-protein kinase Lyn
Ligand
BDBM50385915
Substrate
Meas. Tech.
ChEMBL_824235 (CHEMBL2044290)
IC50
1360±n/a nM
Citation
 Innocenti, PCheung, KMSolanki, SMas-Droux, CRowan, FYeoh, SBoxall, KWestlake, MPickard, LHardy, TBaxter, JEAherne, GWBayliss, RFry, AMHoelder, S Design of potent and selective hybrid inhibitors of the mitotic kinase Nek2: structure-activity relationship, structural biology, and cellular activity. J Med Chem 55:3228-41 (2012)  
Target
Name:
Tyrosine-protein kinase Lyn
Synonyms:
JTK8 LYN_HUMAN Tyrosine-protein kinase Lyn (LYN) p53Lyn | p56Lyn
Type:
Protein
Mol. Mass.:
58575.92
Organism:
Homo sapiens (Human)
Description:
P07948
Residue:
512
  
Inhibitor
Name:
BDBM50385915
Synonyms:
CHEMBL2042135
Type:
Small organic molecule
Emp. Form.:
C24H25F3N4O2S
Mol. Mass.:
490.541
SMILES:
C[C@@H](Oc1cc(ccc1C(N)=O)-c1cc(cnc1N)-c1cc(CN(C)C)cs1)\C=C/C(F)(F)F
: