Target
Cyclin-dependent kinase 2
Ligand
BDBM50385919
Substrate
Meas. Tech.
ChEMBL_824220 (CHEMBL2044155)
IC50
2740±n/a nM
Citation
 Innocenti, PCheung, KMSolanki, SMas-Droux, CRowan, FYeoh, SBoxall, KWestlake, MPickard, LHardy, TBaxter, JEAherne, GWBayliss, RFry, AMHoelder, S Design of potent and selective hybrid inhibitors of the mitotic kinase Nek2: structure-activity relationship, structural biology, and cellular activity. J Med Chem 55:3228-41 (2012)  
Target
Name:
Cyclin-dependent kinase 2
Synonyms:
CDK2 CDK2_HUMAN Cell division protein kinase 2 Protein cereblon/Cyclin-dependent kinase 2 | p33 protein kinase
Type:
Enzyme Subunit
Mol. Mass.:
33938.17
Organism:
Homo sapiens (Human)
Description:
P24941
Residue:
298
  
Inhibitor
Name:
BDBM50385919
Synonyms:
CHEMBL2042031
Type:
Small organic molecule
Emp. Form.:
C30H29F3N4O2
Mol. Mass.:
534.5721
SMILES:
CC(Oc1cc(ccc1C(N)=O)-c1cc(cnc1N)-c1ccc(CN(C)C)cc1)c1ccccc1C(F)(F)F
: