Target
Procathepsin L
Ligand
BDBM50385961
Substrate
Meas. Tech.
ChEMBL_825257 (CHEMBL2043889)
IC50
43000±n/a nM
Citation
 Marques, EFBueno, MADuarte, PDSilva, LRMartinelli, AMdos Santos, CYSeverino, RPBrömme, DVieira, PCCorrêa, AG Evaluation of synthetic acridones and 4-quinolinones as potent inhibitors of cathepsins L and V. Eur J Med Chem 54:10-21 (2012)  
Target
Name:
Procathepsin L
Synonyms:
CATL1_HUMAN CTSL CTSL1 Cathepsin L Cathepsin L1 heavy chain MEP cathepsin L preproprotein
Type:
Enzyme
Mol. Mass.:
37557.19
Organism:
Homo sapiens (Human)
Description:
Purchased from Calbiochem (San Diego, CA).
Residue:
333
  
Inhibitor
Name:
BDBM50385961
Synonyms:
CHEMBL1621187
Type:
Small organic molecule
Emp. Form.:
C13H10N2O4
Mol. Mass.:
258.2295
SMILES:
OC(=O)c1cc(ccc1Nc1ccccc1)[N+]([O-])=O
: