Target
Cathepsin L2
Ligand
BDBM48563
Substrate
Meas. Tech.
ChEMBL_825258 (CHEMBL2043890)
IC50
4700±n/a nM
Citation
 Marques, EFBueno, MADuarte, PDSilva, LRMartinelli, AMdos Santos, CYSeverino, RPBrömme, DVieira, PCCorrêa, AG Evaluation of synthetic acridones and 4-quinolinones as potent inhibitors of cathepsins L and V. Eur J Med Chem 54:10-21 (2012)  
Target
Name:
Cathepsin L2
Synonyms:
CATL2 CTSL2 CTSV Cathepsin V
Type:
Enzyme
Mol. Mass.:
37341.06
Organism:
Homo sapiens (Human)
Description:
O60911
Residue:
334
  
Inhibitor
Name:
BDBM48563
Synonyms:
2-phenyl-1H-quinolin-4-one 2-phenylquinolin-4-ol MLS000084697 cid_161091
Type:
Small organic molecule
Emp. Form.:
C15H11NO
Mol. Mass.:
221.2539
SMILES:
Oc1cc(nc2ccccc12)-c1ccccc1
: