Target
Cathepsin L2
Ligand
BDBM50385961
Substrate
Meas. Tech.
ChEMBL_825258 (CHEMBL2043890)
IC50
10000±n/a nM
Citation
 Marques, EFBueno, MADuarte, PDSilva, LRMartinelli, AMdos Santos, CYSeverino, RPBrömme, DVieira, PCCorrêa, AG Evaluation of synthetic acridones and 4-quinolinones as potent inhibitors of cathepsins L and V. Eur J Med Chem 54:10-21 (2012)  
Target
Name:
Cathepsin L2
Synonyms:
CATL2 CTSL2 CTSV Cathepsin V
Type:
Enzyme
Mol. Mass.:
37341.06
Organism:
Homo sapiens (Human)
Description:
O60911
Residue:
334
  
Inhibitor
Name:
BDBM50385961
Synonyms:
CHEMBL1621187
Type:
Small organic molecule
Emp. Form.:
C13H10N2O4
Mol. Mass.:
258.2295
SMILES:
OC(=O)c1cc(ccc1Nc1ccccc1)[N+]([O-])=O
: