Target
Cholinesterase
Ligand
BDBM50386066
Substrate
Meas. Tech.
ChEMBL_823698 (CHEMBL2045013)
IC50
258030±n/a nM
Citation
 Meng, FCMao, FShan, WJQin, FHuang, LLi, XS Design, synthesis, and evaluation of indanone derivatives as acetylcholinesterase inhibitors and metal-chelating agents. Bioorg Med Chem Lett 22:4462-6 (2012)  
Target
Name:
Cholinesterase
Synonyms:
BCHE CHLE_HORSE | Cholinesterase
Type:
Enzyme
Mol. Mass.:
65643.35
Organism:
Equus caballus (Horse)
Description:
P81908
Residue:
574
  
Inhibitor
Name:
BDBM50386066
Synonyms:
CHEMBL2043047
Type:
Small organic molecule
Emp. Form.:
C10H10O3
Mol. Mass.:
178.1846
SMILES:
COc1cc2CCC(=O)c2cc1O
: