Target
Kynurenine/alpha-aminoadipate aminotransferase, mitochondrial
Ligand
BDBM50386298
Substrate
Meas. Tech.
ChEMBL_826598 (CHEMBL2050766)
IC50
179±n/a nM
Citation
 Dounay, ABAnderson, MBechle, BMCampbell, BMClaffey, MMEvdokimov, AEvrard, EFonseca, KRGan, XGhosh, SHayward, MMHorner, WKim, JYMcAllister, LAPandit, JParadis, VParikh, VDReese, MRRong, SSalafia, MASchuyten, KStrick, CATuttle, JBValentine, JWang, HZawadzke, LEVerhoest, PR Discovery of Brain-Penetrant, Irreversible Kynurenine Aminotransferase II Inhibitors for Schizophrenia. ACS Med Chem Lett 3:187-192 (2012)  
Target
Name:
Kynurenine/alpha-aminoadipate aminotransferase, mitochondrial
Synonyms:
2-aminoadipate aminotransferase AADAT Alpha-aminoadipate aminotransferase KAT2 Kynurenine aminotransferase II Kynurenine--oxoglutarate aminotransferase II Kynurenine--oxoglutarate transaminase II
Type:
Enzyme
Mol. Mass.:
47353.09
Organism:
Homo sapiens (Human)
Description:
Q8N5Z0
Residue:
425
  
Inhibitor
Name:
BDBM50386298
Synonyms:
CHEMBL2049099
Type:
Small organic molecule
Emp. Form.:
C10H12N2O3
Mol. Mass.:
208.2139
SMILES:
COc1cccc2N(O)C(=O)[C@@H](N)Cc12
: