Target
Potassium voltage-gated channel subfamily H member 2
Ligand
BDBM50386331
Substrate
Meas. Tech.
ChEMBL_826679 (CHEMBL2051023)
IC50
>20000±n/a nM
Citation
 Zhong, MGadek, TRBui, MShen, WBurnier, JBarr, KJHanan, EJOslob, JDYu, CHZhu, JArkin, MREvanchik, MJFlanagan, WMHoch, UHyde, JPrabhu, SSilverman, JAWright, J Discovery and Development of Potent LFA-1/ICAM-1 Antagonist SAR 1118 as an Ophthalmic Solution for Treating Dry Eye. ACS Med Chem Lett 3:203-206 (2012)  
Target
Name:
Potassium voltage-gated channel subfamily H member 2
Synonyms:
1,3-beta-glucan synthase component GLS2 ERG Eag-related protein 1 Ether-a-go-go-related gene (HERG) Ether-a-go-go-related gene potassium channel 1 Ether-a-go-go-related gene potassium channel 1 (hERG1) Ether-a-go-go-related protein 1 H-ERG KCNH2 Potassium voltage-gated channel subfamily H member 2 (hERG) Voltage-gated potassium channel subunit Kv11.1 hERG Potassium Channel 1 | putative potassium channel subunit
Type:
Multi-pass membrane protein
Mol. Mass.:
126672.65
Organism:
Homo sapiens (Human)
Description:
Q12809
Residue:
1159
  
Inhibitor
Name:
BDBM50386331
Synonyms:
CHEMBL2048028
Type:
Small organic molecule
Emp. Form.:
C29H24Cl2N2O7S
Mol. Mass.:
615.481
SMILES:
CS(=O)(=O)c1cccc(C[C@H](NC(=O)c2c(Cl)cc3CN(CCc3c2Cl)C(=O)c2ccc3ccoc3c2)C(O)=O)c1
: