Target
Histone deacetylase 1
Ligand
BDBM50386453
Substrate
Meas. Tech.
ChEMBL_827136 (CHEMBL2050420)
IC50
0.9±n/a nM
Citation
 Baud, MGLeiser, THaus, PSamlal, SWong, ACWood, RJPetrucci, VGunaratnam, MHughes, SMBuluwela, LTurlais, FNeidle, SMeyer-Almes, FJWhite, AJFuchter, MJ Defining the mechanism of action and enzymatic selectivity of psammaplin A against its epigenetic targets. J Med Chem 55:1731-50 (2012)  
Target
Name:
Histone deacetylase 1
Synonyms:
Cereblon/Histone deacetylase 1 HDAC1 Histone deacetylase 1 (HDAC1) RPD3L1
Type:
Enzyme
Mol. Mass.:
55090.27
Organism:
Homo sapiens (Human)
Description:
Q13547
Residue:
482
  
Inhibitor
Name:
BDBM50386453
Synonyms:
CHEMBL2047540
Type:
Small organic molecule
Emp. Form.:
C11H13BrN2O3S
Mol. Mass.:
333.202
SMILES:
Oc1ccc(CC(N=O)C(=O)NCCS)cc1Br
: