Target
Amine oxidase [flavin-containing] B
Ligand
BDBM50386547
Substrate
Meas. Tech.
ChEMBL_826183 (CHEMBL2049624)
Ki
33.11±n/a nM
Citation
 Pettersson, FSvensson, PWaters, SWaters, NSonesson, C Synthesis and evaluation of a set of para-substituted 4-phenylpiperidines and 4-phenylpiperazines as monoamine oxidase (MAO) inhibitors. J Med Chem 55:3242-9 (2012)  
Target
Name:
Amine oxidase [flavin-containing] B
Synonyms:
AOFB_RAT Amine oxidase [flavin-containing] B Monoamine Oxidase Type B (MAO-B) Monoamine oxidase B (MAO-B) Monoamine oxidase type B (MAOB) | Monoamine oxidase-B (MAO-B)
Type:
Enzyme
Mol. Mass.:
58469.65
Organism:
Rattus norvegicus (rat)
Description:
P19643
Residue:
520
  
Inhibitor
Name:
BDBM50386547
Synonyms:
CHEMBL2048234
Type:
Small organic molecule
Emp. Form.:
C14H19F3N2O3S
Mol. Mass.:
352.372
SMILES:
CCCN1CCN(CC1)c1ccc(OS(=O)(=O)C(F)(F)F)cc1
: