Target
Sphingosine 1-phosphate receptor 1
Ligand
BDBM50386859
Substrate
Meas. Tech.
ChEMBL_828469 (CHEMBL2049906)
EC50
3.40±n/a nM
Citation
 Buzard, DJHan, SLopez, LKawasaki, AMoody, JThoresen, LUllman, BLehmann, JCalderon, IZhu, XGharbaoui, TSengupta, DKrishnan, AGao, YEdwards, JBarden, JMorgan, MUsmani, KChen, CSadeque, AThatte, JSolomon, MFu, LWhelan, KLiu, LAl-Shamma, HGatlin, JLe, MXing, CEspinola, SJones, RM Fused tricyclic indoles as S1P1 agonists with robust efficacy in animal models of autoimmune disease. Bioorg Med Chem Lett 22:4404-9 (2012)  
Target
Name:
Sphingosine 1-phosphate receptor 1
Synonyms:
CD_antigen=CD363 Endothelial differentiation G-protein coupled receptor 1 S1P receptor Edg-1 S1PR1_RAT Sphingosine 1-phosphate receptor Edg-1
Type:
PROTEIN
Mol. Mass.:
42770.88
Organism:
Rattus norvegicus
Description:
ChEMBL_1463793
Residue:
383
  
Inhibitor
Name:
BDBM50386859
Synonyms:
CHEMBL2048293
Type:
Small organic molecule
Emp. Form.:
C23H15F3N4O4
Mol. Mass.:
468.3848
SMILES:
OC(=O)CC1CCn2c1cc1cc(ccc21)-c1noc(n1)-c1cc(OC(F)(F)F)cc(c1)C#N
: