Target
Macrophage metalloelastase
Ligand
BDBM7459
Substrate
Meas. Tech.
ChEMBL_827437 (CHEMBL2051216)
IC50
980±n/a nM
Citation
 Wang, LLi, XZhang, SLu, WLiao, SLiu, XShan, LShen, XJiang, HZhang, WHuang, JLi, H Natural products as a gold mine for selective matrix metalloproteinases inhibitors. Bioorg Med Chem 20:4164-71 (2012)  
Target
Name:
Macrophage metalloelastase
Synonyms:
HME MMP12_HUMAN Matrix metalloproteinase-12 (MMP 12) Matrix metalloproteinase-12 (MMP12) | Matrix metalloproteinases 12 (MMP-12)
Type:
Enzyme
Mol. Mass.:
54012.99
Organism:
Homo sapiens (Human)
Description:
P39900
Residue:
470
  
Inhibitor
Name:
BDBM7459
Synonyms:
2-(3,4-dihydroxyphenyl)-5,7-dihydroxy-4H-chromen-4-one CHEMBL151 Luteolin (4) cid_5280445 med.21724, Compound 3
Type:
Small organic molecule
Emp. Form.:
C15H10O6
Mol. Mass.:
286.2363
SMILES:
Oc1cc(O)c2c(c1)oc(cc2=O)-c1ccc(O)c(O)c1
: