Target
Glycogen synthase kinase-3 beta
Ligand
BDBM50386933
Substrate
Meas. Tech.
ChEMBL_827456 (CHEMBL2051313)
EC50
1.5±n/a nM
Citation
 Lee, SCKim, HTPark, CHLee, do YChang, HJPark, SCho, JMRo, SSuh, YG Design, synthesis and biological evaluation of novel imidazopyridines as potential antidiabetic GSK3ß inhibitors. Bioorg Med Chem Lett 22:4221-4 (2012)  
Target
Name:
Glycogen synthase kinase-3 beta
Synonyms:
GSK-3 beta GSK3B Glycogen synthase kinase 3 beta (GSK3B) Glycogen synthase kinase-3 beta (GSK-3B) Glycogen synthase kinase-3 beta (GSK3B) Glycogen synthase kinase-3beta (GSK3B) | Serine/threonine-protein kinase GSK3B
Type:
Enzyme
Mol. Mass.:
46756.38
Organism:
Homo sapiens (Human)
Description:
P49841
Residue:
420
  
Inhibitor
Name:
BDBM50386933
Synonyms:
CHEMBL2048678
Type:
Small organic molecule
Emp. Form.:
C20H16FN5O2
Mol. Mass.:
377.3717
SMILES:
CCOc1ccncc1NC(=O)c1ccnc2nc([nH]c12)-c1ccc(F)cc1
: