Target
Furin
Ligand
BDBM50387000
Substrate
Meas. Tech.
ChEMBL_827555 (CHEMBL2051583)
Ki
1.6±n/a nM
Citation
 López-Vallejo, FMartínez-Mayorga, K Furin inhibitors: importance of the positive formal charge and beyond. Bioorg Med Chem 20:4462-71 (2012)  
Target
Name:
Furin
Synonyms:
FUR FURIN_HUMAN PACE | PCSK3
Type:
Enzyme Catalytic Domain
Mol. Mass.:
86676.01
Organism:
Homo sapiens (Human)
Description:
P09958
Residue:
794
  
Inhibitor
Name:
BDBM50387000
Synonyms:
CHEMBL2049153
Type:
Small organic molecule
Emp. Form.:
C34H60N12O4
Mol. Mass.:
700.9182
SMILES:
[#6]-[#6]-[#6]-[#6]-[#6]-[#6]-[#6]-[#6]-[#6]-[#6](=O)-[#7]-[#6@@H](-[#6]-[#6]-[#6]\[#7]=[#6](/[#7])-[#7])-[#6](=O)-[#7]-[#6@@H](-[#6](-[#6])-[#6])-[#6](=O)-[#7]-[#6@@H](-[#6]-[#6]-[#6]\[#7]=[#6](\[#7])-[#7])-[#6](=O)-[#7]-c1ccc(cc1)-[#6](-[#7])=[#7]
: