Target
Epidermal growth factor receptor
Ligand
BDBM50387040
Substrate
Meas. Tech.
ChEMBL_827636 (CHEMBL2050675)
IC50
3530±n/a nM
Citation
 Zuo, MZheng, YWLu, SMLi, YZhang, SQ Synthesis and biological evaluation of N-aryl salicylamides with a hydroxamic acid moiety at 5-position as novel HDAC-EGFR dual inhibitors. Bioorg Med Chem 20:4405-12 (2012)  
Target
Name:
Epidermal growth factor receptor
Synonyms:
EGF Receptor Substrate EGFR_HUMAN ERBB1 Epidermal Growth Factor Receptor erbB-1 Epidermal growth factor receptor (EGFR) HER1 Proto-oncogene c-ErbB-1 Tyrosine-Protein Kinase ErbB-1
Type:
Receptor Kinase Domain
Mol. Mass.:
134279.59
Organism:
Homo sapiens (Human)
Description:
P00533
Residue:
1210
  
Inhibitor
Name:
BDBM50387040
Synonyms:
CHEMBL2047018
Type:
Small organic molecule
Emp. Form.:
C20H21ClFN3O5
Mol. Mass.:
437.849
SMILES:
ONC(=O)CCCCCC(=O)Nc1ccc(O)c(c1)C(=O)Nc1ccc(F)c(Cl)c1
: