Target
Carbonic anhydrase 2
Ligand
BDBM50387117
Substrate
Meas. Tech.
ChEMBL_827863 (CHEMBL2051272)
Ki
413±n/a nM
Citation
 Winum, JYCarta, FWard, CMullen, PHarrison, DLangdon, SPCecchi, AScozzafava, AKunkler, ISupuran, CT Ureido-substituted sulfamates show potent carbonic anhydrase IX inhibitory and antiproliferative activities against breast cancer cell lines. Bioorg Med Chem Lett 22:4681-5 (2012)  
Target
Name:
Carbonic anhydrase 2
Synonyms:
CA-II CAC Carbonate dehydratase II Carbonic anhydrase 2 (CA-II) Carbonic anhydrase C Carbonic anhydrase II (CA-II) Carbonic anhydrase II (hCA II) | Carbonic anhydrase isoenzyme II (hCA II)
Type:
Enzyme
Mol. Mass.:
29250.71
Organism:
Homo sapiens (Human)
Description:
P00918
Residue:
260
  
Inhibitor
Name:
BDBM50387117
Synonyms:
4-ureidophenyl sulfamate ring derivative 3g | CHEMBL2047802
Type:
Small organic molecule
Emp. Form.:
C14H15N3O5S
Mol. Mass.:
337.351
SMILES:
COc1ccc(NC(=O)Nc2ccc(OS(N)(=O)=O)cc2)cc1
: