Target
Carbonic anhydrase 2
Ligand
BDBM50387151
Substrate
Meas. Tech.
ChEMBL_827863 (CHEMBL2051272)
Ki
750±n/a nM
Citation
 Winum, JYCarta, FWard, CMullen, PHarrison, DLangdon, SPCecchi, AScozzafava, AKunkler, ISupuran, CT Ureido-substituted sulfamates show potent carbonic anhydrase IX inhibitory and antiproliferative activities against breast cancer cell lines. Bioorg Med Chem Lett 22:4681-5 (2012)  
Target
Name:
Carbonic anhydrase 2
Synonyms:
CA-II CAC Carbonate dehydratase II Carbonic anhydrase 2 (CA-II) Carbonic anhydrase C Carbonic anhydrase II (CA-II) Carbonic anhydrase II (hCA II) | Carbonic anhydrase isoenzyme II (hCA II)
Type:
Enzyme
Mol. Mass.:
29250.71
Organism:
Homo sapiens (Human)
Description:
P00918
Residue:
260
  
Inhibitor
Name:
BDBM50387151
Synonyms:
4-ureidophenyl sulfamate ring derivative 3ao | CHEMBL2047833
Type:
Small organic molecule
Emp. Form.:
C20H17N3O4S
Mol. Mass.:
395.432
SMILES:
NS(=O)(=O)Oc1ccc(NC(=O)NC2c3ccccc3-c3ccccc23)cc1
: