Target
Anoctamin-1
Ligand
BDBM50387362
Substrate
Meas. Tech.
ChEMBL_828184 (CHEMBL2050116)
IC50
16300±n/a nM
Citation
 Kumar, SNamkung, WVerkman, ASSharma, PK Novel 5-substituted benzyloxy-2-arylbenzofuran-3-carboxylic acids as calcium activated chloride channel inhibitors. Bioorg Med Chem 20:4237-44 (2012)  
Target
Name:
Anoctamin-1
Synonyms:
ANO1 DOG1 ORAOV2 TAOS2 Transmembrane protein 16A | Tumor-amplified and overexpressed sequence 2
Type:
PROTEIN
Mol. Mass.:
114103.63
Organism:
Homo sapiens (Human)
Description:
ChEMBL_828184
Residue:
986
  
Inhibitor
Name:
BDBM50387362
Synonyms:
CHEMBL2046974
Type:
Small organic molecule
Emp. Form.:
C23H17BrO5
Mol. Mass.:
453.282
SMILES:
COc1ccc(cc1)-c1oc2ccc(OCc3ccc(Br)cc3)cc2c1C(O)=O
: