Target
Long-chain fatty acid transport protein 1
Ligand
BDBM50387681
Substrate
Meas. Tech.
ChEMBL_830659 (CHEMBL2061594)
IC50
520±n/a nM
Citation
 Matsufuji, TIkeda, MNaito, AHirouchi, MTakakusa, HKanda, SIzumi, MHarada, JShinozuka, T Discovery and optimization of novel fatty acid transport protein 1 (FATP1) inhibitors. Bioorg Med Chem Lett 22:5067-70 (2012)  
Target
Name:
Long-chain fatty acid transport protein 1
Synonyms:
6.2.1.- Fatp Fatty acid transport protein 1 Slc27a1 | Solute carrier family 27 member 1
Type:
PROTEIN
Mol. Mass.:
71289.41
Organism:
Mus musculus
Description:
ChEMBL_956919
Residue:
646
  
Inhibitor
Name:
BDBM50387681
Synonyms:
CHEMBL2058346
Type:
Small organic molecule
Emp. Form.:
C23H25N5O2S
Mol. Mass.:
435.542
SMILES:
CCn1c(CNc2ccccc2)nnc1SCc1nc2cc(ccc2o1)C(=O)C(C)C
: