Target
Alpha-2B adrenergic receptor
Ligand
BDBM50016897
Substrate
Meas. Tech.
ChEMBL_828758 (CHEMBL2060408)
Ki
32±n/a nM
Citation
 Schann, SGreney, HGasparik, VDontenwill, MRascente, CLacroix, GMonassier, LBruban, VFeldman, JEhrhardt, JDBousquet, P Methylation of imidazoline related compounds leads to loss ofa2-adrenoceptor affinity. Synthesis and biological evaluation of selective I1 imidazoline receptor ligands. Bioorg Med Chem 20:4710-5 (2012)  
Target
Name:
Alpha-2B adrenergic receptor
Synonyms:
ADA2B_HUMAN ADRA2L1 Adrenergic alpha2B Adrenergic receptor alpha Alpha-2 adrenergic receptor subtype C2 Alpha-2B adrenoreceptor | Alpha-2BAR
Type:
Enzyme
Mol. Mass.:
49964.20
Organism:
Homo sapiens (Human)
Description:
P18089
Residue:
450
  
Inhibitor
Name:
BDBM50016897
Synonyms:
2-(2,6-dichloroanilino)-1,3-diazacyclopentene-(2) CLONIDINE clonidine (amino form)
Type:
Small organic molecule
Emp. Form.:
C9H9Cl2N3
Mol. Mass.:
230.094
SMILES:
Clc1cccc(Cl)c1\[#7]=[#6]-1\[#7]-[#6]-[#6]-[#7]-1
: